{"text_format":"1","workbook":"xlsx","n_sheets":6,"sheets":["Configurator","Wiring Table","Heads & Actuator","Wiring Requirements","QD","List Price"],"not_rendered":{"charts":0,"images":0,"macros":1,"external_links":0,"defined_names":0,"comments":0,"pivot_tables":0},"unopened":[],"bounds":{"document_bytes":16777216,"sheet_cells":100000,"rows_first":2000,"rows_last":500,"rows_between":2000,"halvings":0,"cell_chars":16384,"cell_head_chars":4096},"cells_cut":0,"cells_raw":0,"read":"whole","date_system":"1900"}

{"sheet":"Configurator","index":0,"n_rows":119,"n_cols":43,"rows_kept":119,"cut":false,"hidden":false,"merged":[[105,9,105,10],[106,9,106,10],[116,9,116,10],[117,9,117,10],[107,9,107,10],[108,9,108,10],[109,9,109,10],[114,9,114,10],[115,9,115,10],[110,9,110,10],[111,9,111,10],[112,9,112,10],[113,9,113,10],[101,9,101,10],[102,9,102,10],[103,9,103,10],[104,9,104,10],[100,9,100,10],[18,13,18,23],[34,13,34,23],[47,6,47,7],[48,6,48,7],[20,4,20,7],[21,4,21,7],[24,4,24,7],[25,4,25,7],[27,4,27,7],[18,4,18,7],[32,7,33,7],[38,7,39,7],[34,7,37,7],[23,3,23,7],[28,4,28,7],[24,2,28,2],[30,2,39,2],[59,2,95,2],[99,2,117,2],[53,6,53,7],[54,6,54,7],[56,4,56,7],[57,4,57,7],[47,2,54,2],[56,2,57,2],[49,6,49,7],[50,6,50,7],[51,6,51,7],[52,6,52,7],[58,3,58,7],[98,3,98,7],[1,10,1,11],[0,8,1,9],[11,2,15,2],[17,2,18,2],[20,2,21,2],[10,4,10,7],[13,4,13,7],[14,4,14,7],[15,4,15,7],[17,4,17,7],[11,4,11,7],[12,4,12,7],[7,5,7,7]]}
[null,null,null,null,null,null,null,null,"Weight"]
[null,null,null,null,null,null,null,null,null,null,{"$f":"'Wiring Requirements'!AY16","v":0},null,"Kg"]
[]
[null,null,null,null,null,null,null,null,"Head",1,2,3,4,5,6,7,8,9,10,"Base"]
[null,null,null,null,null,null,null,null,{"$f":"'Heads & Actuator'!C14","v":0},{"$f":"IF(ISNA(VLOOKUP(J4,$B$21:$H$58,3,FALSE)),K5,VLOOKUP(J4,$B$21:$H$58,3,FALSE))","v":0},{"$f":"IF(ISNA(VLOOKUP(K4,$B$21:$H$58,3,FALSE)),L5,VLOOKUP(K4,$B$21:$H$58,3,FALSE))","v":0},0,0,0,0,0,0,0,0,0]
[null,null,null,null,null,{"$f":"IF(AND(M19=1,M41+M28+M29=0),1,0)","v":0},null,null,null,{"$f":"HLOOKUP(J4,$M$59:$V$98,40,FALSE)","v":0},{"$f":"HLOOKUP(K4,$M$59:$V$98,40,FALSE)","v":0},{"$f":"HLOOKUP(L4,$M$59:$V$98,40,FALSE)","v":0},{"$f":"HLOOKUP(M4,$M$59:$V$98,40,FALSE)","v":0},{"$f":"HLOOKUP(N4,$M$59:$V$98,40,FALSE)","v":0},0,0,0,0,0,{"$f":"VLOOKUP(1,$M$100:$W$118,11,FALSE)","v":{"$error":"#N/A"}}]
[null,null,null,null,null,null,null,null,null,{"$f":"IF(ISNA(J6),1,IF(AND(J6=0,J5<>0),1,0))","v":0},0,0,0,0,0,0,0,0,0]
[null,null,null,null,null,{"$f":"IF(OR(I8=0,T8=0,AND(T8<>0, M20=0)),\"Error - You need a Head & Base\",IF(AB119=1,\"Error - Base is not valid\",IF(AND(M23>=1,M41=0),\"You must select safety contacts to go with IR\",IF(F6=1,\"Error-Head has no lock or switch\",\"\"))))","v":"Error - You need a Head & Base"},null,null,{"$f":"I5","v":0},{"$f":"IF(J7=0,IF(J6=0,0,RIGHT(J6,2)),IF(J5=0,0,IF(LEN(J5)=3,RIGHT(J5,2),IF(J5=K5,MID(J5,2,2),RIGHT(J5,2)))))","v":0},{"$f":"IF(K7=0,IF(K6=0,0,RIGHT(K6,2)),IF(K5=0,0,IF(LEN(K5)=3,RIGHT(K5,2),IF(K5=L5,MID(K5,2,2),RIGHT(K5,2)))))","v":0},0,0,0,0,0,0,0,0,{"$f":"IF(ISNA(T6),0,RIGHT(T6,2))","v":0},null,null,{"$f":"IF(ISNA(T8),0,IF(OR((MAX(A21:A57)+SUM(M60:V96))+M58=7,(MAX(A21:A57)+SUM(M60:V96))+M58=9),1,0))","v":0}]
[]
[]
{"$rows_left_out":110}
{"sheet":"Wiring Table","index":1,"n_rows":19,"n_cols":16,"rows_kept":19,"cut":false,"hidden":false,"merged":[]}
[]
[null,"Head",1,2,3,4,5,6,7,8,9,10,"Base"]
[null,{"$f":"IF(Configurator!I8=0,\"\",Configurator!I8)","v":""},{"$f":"IF(Configurator!J8=0,\"\",Configurator!J8)","v":""},{"$f":"IF(Configurator!K8=0,\"\",Configurator!K8)","v":""},{"$f":"IF(Configurator!L8=0,\"\",Configurator!L8)","v":""},{"$f":"IF(Configurator!M8=0,\"\",Configurator!M8)","v":""},{"$f":"IF(Configurator!N8=0,\"\",Configurator!N8)","v":""},{"$f":"IF(Configurator!O8=0,\"\",Configurator!O8)","v":""},{"$f":"IF(Configurator!P8=0,\"\",Configurator!P8)","v":""},{"$f":"IF(Configurator!Q8=0,\"\",Configurator!Q8)","v":""},{"$f":"IF(Configurator!R8=0,\"\",Configurator!R8)","v":""},{"$f":"IF(Configurator!S8=0,\"\",Configurator!S8)","v":""},{"$f":"IF(Configurator!T8=0,\"\",Configurator!T8)","v":""}]
[]
[null,null,"Input","Output","2nd\nOutput","SC1 in","SC2 in","SC1 out","SC2 out","SC3 in","SC4 in","SC3 out","SC4 out","+24V","0V","Earth"]
[null,{"$f":"IF('Wiring Requirements'!E5=0,\"\",'Wiring Requirements'!E5)","v":""},{"$f":"VLOOKUP('Wiring Requirements'!P5,'Wiring Requirements'!$Z$5:$AB$30,2,FALSE)","v":{"$error":"#N/A"}},{"$f":"VLOOKUP('Wiring Requirements'!Q5,'Wiring Requirements'!$Z$5:$AB$30,2,FALSE)","v":{"$error":"#N/A"}},{"$f":"VLOOKUP('Wiring Requirements'!R5,'Wiring Requirements'!$Z$5:$AB$30,2,FALSE)","v":{"$error":"#N/A"}},{"$f":"IF('Wiring Requirements'!U5=1,VLOOKUP(F$5,'Wiring Requirements'!$Z$5:$AA$30,2,FALSE),IF('Wiring Requirements'!U5=2,\"******\",\"-\"))","v":"-"},{"$f":"IF('Wiring Requirements'!U5=1,VLOOKUP(G$5,'Wiring Requirements'!$Z$5:$AA$30,2,FALSE),IF('Wiring Requirements'!U5=2,\"******\",\"-\"))","v":"-"},{"$f":"IF('Wiring Requirements'!V5=1,VLOOKUP(H$5,'Wiring Requirements'!$Z$5:$AA$30,2,FALSE),IF('Wiring Requirements'!V5=2,\"******\",\"-\"))","v":"-"},{"$f":"IF('Wiring Requirements'!V5=1,VLOOKUP(I$5,'Wiring Requirements'!$Z$5:$AA$30,2,FALSE),IF('Wiring Requirements'!V5=2,\"******\",\"-\"))","v":"-"},{"$f":"IF('Wiring Requirements'!W5=1,VLOOKUP(J$5,'Wiring Requirements'!$Z$5:$AA$30,2,FALSE),IF('Wiring Requirements'!W5=2,\"******\",\"-\"))","v":"-"},{"$f":"IF('Wiring Requirements'!W5=1,VLOOKUP(K$5,'Wiring Requirements'!$Z$5:$AA$30,2,FALSE),IF('Wiring Requirements'!W5=2,\"******\",\"-\"))","v":"-"},{"$f":"IF('Wiring Requirements'!X5=1,VLOOKUP(L$5,'Wiring Requirements'!$Z$5:$AA$30,2,FALSE),IF('Wiring Requirements'!X5=2,\"******\",\"-\"))","v":"-"},{"$f":"IF('Wiring Requirements'!X5=1,VLOOKUP(M$5,'Wiring Requirements'!$Z$5:$AA$30,2,FALSE),IF('Wiring Requirements'!X5=2,\"******\",\"-\"))","v":"-"}]
[null,{"$f":"IF('Wiring Requirements'!E6=0,\"\",'Wiring Requirements'!E6)","v":""},{"$f":"VLOOKUP('Wiring Requirements'!P6,'Wiring Requirements'!$Z$5:$AB$30,2,FALSE)","v":{"$error":"#N/A"}},{"$f":"VLOOKUP('Wiring Requirements'!Q6,'Wiring Requirements'!$Z$5:$AB$30,2,FALSE)","v":{"$error":"#N/A"}},{"$f":"VLOOKUP('Wiring Requirements'!R6,'Wiring Requirements'!$Z$5:$AB$30,2,FALSE)","v":{"$error":"#N/A"}},{"$f":"IF('Wiring Requirements'!U6=1,VLOOKUP(F$5,'Wiring Requirements'!$Z$5:$AA$30,2,FALSE),IF('Wiring Requirements'!U6=2,\"******\",\"-\"))","v":"-"},{"$f":"IF('Wiring Requirements'!U6=1,VLOOKUP(G$5,'Wiring Requirements'!$Z$5:$AA$30,2,FALSE),IF('Wiring Requirements'!U6=2,\"******\",\"-\"))","v":"-"},{"$f":"IF('Wiring Requirements'!V6=1,VLOOKUP(H$5,'Wiring Requirements'!$Z$5:$AA$30,2,FALSE),IF('Wiring Requirements'!V6=2,\"******\",\"-\"))","v":"-"},{"$f":"IF('Wiring Requirements'!V6=1,VLOOKUP(I$5,'Wiring Requirements'!$Z$5:$AA$30,2,FALSE),IF('Wiring Requirements'!V6=2,\"******\",\"-\"))","v":"-"},{"$f":"IF('Wiring Requirements'!W6=1,VLOOKUP(J$5,'Wiring Requirements'!$Z$5:$AA$30,2,FALSE),IF('Wiring Requirements'!W6=2,\"******\",\"-\"))","v":"-"},{"$f":"IF('Wiring Requirements'!W6=1,VLOOKUP(K$5,'Wiring Requirements'!$Z$5:$AA$30,2,FALSE),IF('Wiring Requirements'!W6=2,\"******\",\"-\"))","v":"-"},{"$f":"IF('Wiring Requirements'!X6=1,VLOOKUP(L$5,'Wiring Requirements'!$Z$5:$AA$30,2,FALSE),IF('Wiring Requirements'!X6=2,\"******\",\"-\"))","v":"-"},{"$f":"IF('Wiring Requirements'!X6=1,VLOOKUP(M$5,'Wiring Requirements'!$Z$5:$AA$30,2,FALSE),IF('Wiring Requirements'!X6=2,\"******\",\"-\"))","v":"-"}]
[null,{"$f":"IF('Wiring Requirements'!E7=0,\"\",'Wiring Requirements'!E7)","v":""},{"$f":"VLOOKUP('Wiring Requirements'!P7,'Wiring Requirements'!$Z$5:$AB$30,2,FALSE)","v":{"$error":"#N/A"}},{"$f":"VLOOKUP('Wiring Requirements'!Q7,'Wiring Requirements'!$Z$5:$AB$30,2,FALSE)","v":{"$error":"#N/A"}},{"$f":"VLOOKUP('Wiring Requirements'!R7,'Wiring Requirements'!$Z$5:$AB$30,2,FALSE)","v":{"$error":"#N/A"}},{"$f":"IF('Wiring Requirements'!U7=1,VLOOKUP(F$5,'Wiring Requirements'!$Z$5:$AA$30,2,FALSE),IF('Wiring Requirements'!U7=2,\"******\",\"-\"))","v":"-"},{"$f":"IF('Wiring Requirements'!U7=1,VLOOKUP(G$5,'Wiring Requirements'!$Z$5:$AA$30,2,FALSE),IF('Wiring Requirements'!U7=2,\"******\",\"-\"))","v":"-"},{"$f":"IF('Wiring Requirements'!V7=1,VLOOKUP(H$5,'Wiring Requirements'!$Z$5:$AA$30,2,FALSE),IF('Wiring Requirements'!V7=2,\"******\",\"-\"))","v":"-"},{"$f":"IF('Wiring Requirements'!V7=1,VLOOKUP(I$5,'Wiring Requirements'!$Z$5:$AA$30,2,FALSE),IF('Wiring Requirements'!V7=2,\"******\",\"-\"))","v":"-"},{"$f":"IF('Wiring Requirements'!W7=1,VLOOKUP(J$5,'Wiring Requirements'!$Z$5:$AA$30,2,FALSE),IF('Wiring Requirements'!W7=2,\"******\",\"-\"))","v":"-"},{"$f":"IF('Wiring Requirements'!W7=1,VLOOKUP(K$5,'Wiring Requirements'!$Z$5:$AA$30,2,FALSE),IF('Wiring Requirements'!W7=2,\"******\",\"-\"))","v":"-"},{"$f":"IF('Wiring Requirements'!X7=1,VLOOKUP(L$5,'Wiring Requirements'!$Z$5:$AA$30,2,FALSE),IF('Wiring Requirements'!X7=2,\"******\",\"-\"))","v":"-"},{"$f":"IF('Wiring Requirements'!X7=1,VLOOKUP(M$5,'Wiring Requirements'!$Z$5:$AA$30,2,FALSE),IF('Wiring Requirements'!X7=2,\"******\",\"-\"))","v":"-"}]
[null,{"$f":"IF('Wiring Requirements'!E8=0,\"\",'Wiring Requirements'!E8)","v":""},{"$f":"VLOOKUP('Wiring Requirements'!P8,'Wiring Requirements'!$Z$5:$AB$30,2,FALSE)","v":{"$error":"#N/A"}},{"$f":"VLOOKUP('Wiring Requirements'!Q8,'Wiring Requirements'!$Z$5:$AB$30,2,FALSE)","v":{"$error":"#N/A"}},{"$f":"VLOOKUP('Wiring Requirements'!R8,'Wiring Requirements'!$Z$5:$AB$30,2,FALSE)","v":{"$error":"#N/A"}},{"$f":"IF('Wiring Requirements'!U8=1,VLOOKUP(F$5,'Wiring Requirements'!$Z$5:$AA$30,2,FALSE),IF('Wiring Requirements'!U8=2,\"******\",\"-\"))","v":"-"},{"$f":"IF('Wiring Requirements'!U8=1,VLOOKUP(G$5,'Wiring Requirements'!$Z$5:$AA$30,2,FALSE),IF('Wiring Requirements'!U8=2,\"******\",\"-\"))","v":"-"},{"$f":"IF('Wiring Requirements'!V8=1,VLOOKUP(H$5,'Wiring Requirements'!$Z$5:$AA$30,2,FALSE),IF('Wiring Requirements'!V8=2,\"******\",\"-\"))","v":"-"},{"$f":"IF('Wiring Requirements'!V8=1,VLOOKUP(I$5,'Wiring Requirements'!$Z$5:$AA$30,2,FALSE),IF('Wiring Requirements'!V8=2,\"******\",\"-\"))","v":"-"},{"$f":"IF('Wiring Requirements'!W8=1,VLOOKUP(J$5,'Wiring Requirements'!$Z$5:$AA$30,2,FALSE),IF('Wiring Requirements'!W8=2,\"******\",\"-\"))","v":"-"},{"$f":"IF('Wiring Requirements'!W8=1,VLOOKUP(K$5,'Wiring Requirements'!$Z$5:$AA$30,2,FALSE),IF('Wiring Requirements'!W8=2,\"******\",\"-\"))","v":"-"},{"$f":"IF('Wiring Requirements'!X8=1,VLOOKUP(L$5,'Wiring Requirements'!$Z$5:$AA$30,2,FALSE),IF('Wiring Requirements'!X8=2,\"******\",\"-\"))","v":"-"},{"$f":"IF('Wiring Requirements'!X8=1,VLOOKUP(M$5,'Wiring Requirements'!$Z$5:$AA$30,2,FALSE),IF('Wiring Requirements'!X8=2,\"******\",\"-\"))","v":"-"}]
[null,{"$f":"IF('Wiring Requirements'!E9=0,\"\",'Wiring Requirements'!E9)","v":""},{"$f":"VLOOKUP('Wiring Requirements'!P9,'Wiring Requirements'!$Z$5:$AB$30,2,FALSE)","v":{"$error":"#N/A"}},{"$f":"VLOOKUP('Wiring Requirements'!Q9,'Wiring Requirements'!$Z$5:$AB$30,2,FALSE)","v":{"$error":"#N/A"}},{"$f":"VLOOKUP('Wiring Requirements'!R9,'Wiring Requirements'!$Z$5:$AB$30,2,FALSE)","v":{"$error":"#N/A"}},{"$f":"IF('Wiring Requirements'!U9=1,VLOOKUP(F$5,'Wiring Requirements'!$Z$5:$AA$30,2,FALSE),IF('Wiring Requirements'!U9=2,\"******\",\"-\"))","v":"-"},{"$f":"IF('Wiring Requirements'!U9=1,VLOOKUP(G$5,'Wiring Requirements'!$Z$5:$AA$30,2,FALSE),IF('Wiring Requirements'!U9=2,\"******\",\"-\"))","v":"-"},{"$f":"IF('Wiring Requirements'!V9=1,VLOOKUP(H$5,'Wiring Requirements'!$Z$5:$AA$30,2,FALSE),IF('Wiring Requirements'!V9=2,\"******\",\"-\"))","v":"-"},{"$f":"IF('Wiring Requirements'!V9=1,VLOOKUP(I$5,'Wiring Requirements'!$Z$5:$AA$30,2,FALSE),IF('Wiring Requirements'!V9=2,\"******\",\"-\"))","v":"-"},{"$f":"IF('Wiring Requirements'!W9=1,VLOOKUP(J$5,'Wiring Requirements'!$Z$5:$AA$30,2,FALSE),IF('Wiring Requirements'!W9=2,\"******\",\"-\"))","v":"-"},{"$f":"IF('Wiring Requirements'!W9=1,VLOOKUP(K$5,'Wiring Requirements'!$Z$5:$AA$30,2,FALSE),IF('Wiring Requirements'!W9=2,\"******\",\"-\"))","v":"-"},{"$f":"IF('Wiring Requirements'!X9=1,VLOOKUP(L$5,'Wiring Requirements'!$Z$5:$AA$30,2,FALSE),IF('Wiring Requirements'!X9=2,\"******\",\"-\"))","v":"-"},{"$f":"IF('Wiring Requirements'!X9=1,VLOOKUP(M$5,'Wiring Requirements'!$Z$5:$AA$30,2,FALSE),IF('Wiring Requirements'!X9=2,\"******\",\"-\"))","v":"-"}]
{"$rows_left_out":10}
{"sheet":"Heads & Actuator","index":2,"n_rows":14,"n_cols":6,"rows_kept":14,"cut":false,"hidden":false,"merged":[]}
[]
["Head",{"$f":"Configurator!M19","v":0}]
[]
[{"$f":"Configurator!M12","v":0},"TAF","THF","Head + Fixed Actuator"]
[{"$f":"Configurator!M13","v":0},"TAH","THH","Head + Hinged Actuator"]
[{"$f":"Configurator!M14","v":0},"TAS","THS","Head + Sliding Actuator"]
[{"$f":"Configurator!M15","v":0},"TEN","THN","Head + Handle Actuator (No red handle)",null,"THE"]
[{"$f":"Configurator!M16","v":0},"TEH ","THE","Head + Handle Actuator"]
[]
[1,{"$f":"VLOOKUP(A10,A4:C8,2,FALSE)","v":{"$error":"#N/A"}},{"$f":"VLOOKUP(A10,A4:C8,3,FALSE)","v":{"$error":"#N/A"}}]
{"$rows_left_out":5}
{"sheet":"Wiring Requirements","index":3,"n_rows":33,"n_cols":51,"rows_kept":33,"cut":false,"hidden":false,"merged":[]}
[null,null,null,null,null,null,null,null,null,null,null,null,null,null,null,null,null,null,null,null,1,2]
[null,null,null,null,null,null,null,null,null,null,null,null,null,null,null,null,null,null,null,null,0,0,1,1]
[null,null,null,null,null,null,null,null,null,null,null,null,null,null,null,null,null,null,null,null,2,1,null,null,null,null,{"$f":"RIGHT(Z4)+1-1","v":0},null,null,null,null,null,null,"List Price",null,null,null,null,null,null,null,null,null,null,null,null,null,null,null,null,"Weight"]
["Head",{"$f":"Configurator!I8","v":0},null,null,null,"Input","Output","Safety",null,"Input","Std Output","Anti Clock Output","Safety",null,null,"Input","Std Output","Anti Clock Output",null,null,"1&2 in","1&2 out","3&4 in","3&4 out",null,{"$f":"E15","v":0},{"$f":"IF(LEFT(Z4,2)=\"TC\",1,0)","v":0},"Pin",null,null,null,null,null,{"$f":"IF(B4=0,0,VLOOKUP(B4,'List Price'!$B$3:$C$98,2,FALSE))","v":0},null,2,3,4,5,8,9,null,null,null,null,null,null,null,null,null,{"$f":"IF(B4=0,0,VLOOKUP(B4,'List Price'!$B$3:$D$98,3,FALSE))","v":0}]
[1,{"$f":"Configurator!J8","v":0},"T",{"$f":"B5","v":0},{"$f":"IF(D5=0,0,CONCATENATE(C5,D5))","v":0},{"$f":"IF(E5=0,0,VLOOKUP($E5,Configurator!$D$12:$L$118,7,FALSE))","v":0},{"$f":"IF(E5=0,0,VLOOKUP($E5,Configurator!$D$12:$L$118,8,FALSE))","v":0},{"$f":"IF(E5=0,0,VLOOKUP($E5,Configurator!$D$12:$L$118,9,FALSE))","v":0},null,{"$f":"F5","v":0},{"$f":"IF(G5=0,0, IF(G5=1,1, IF(G5=2,1)))","v":0},{"$f":"IF(G5=2,1,0)","v":0},{"$f":"H5","v":0},{"$f":"M5-MROUND(M5,1)","v":0},{"$f":"MAX($P6:R$14)","v":0},{"$f":"IF(J5=1,O5+J5,0)","v":0},{"$f":"IF(K5=1,MAX(O5:P5)+K5,0)","v":0},{"$f":"IF(L5=1,MAX(O5:Q5)+L5,0)","v":0},{"$f":"IF(M5=0,0,M5)","v":0},{"$f":"S5-MROUND(S5,1)","v":0},{"$f":"IF(M5=0,0,IF(N5=0,IF(S5<3,1,0),2))","v":0},{"$f":"IF(M5=0,0,IF(N5=0,IF(S5>3,0,IF(T5=$N$16,1,2)),IF(T5=$N$16,1,2)))","v":0},{"$f":"IF(M5=0,0,IF(S5<3,0,IF(N5=0,1,0)))","v":0},{"$f":"IF(M5=0,0,IF(S5<3,0,IF(N5=0,1,0)))","v":0},null,{"$f":"HLOOKUP($Z$4,QD!$B$1:$S$27,AB5+1,FALSE)","v":{"$error":"#N/A"}},{"$f":"IF(Z5=0,\"-\",IF($AA$4=1,(HLOOKUP($AA$3,$AJ$4:$AO$23,$AI5,FALSE)),AB5))","v":{"$error":"#N/A"}},1,{"$f":"HLOOKUP($AA$3,$AJ$4:$AO$23,$AI5,FALSE)","v":{"$error":"#N/A"}},null,null,{"$f":"IF(LEN(AF4)=4,0,IF(AND(OR(B5=\"SS\",B5=\"SM\"),OR(RIGHT(B6,1)=\"L\",RIGHT(B6,1)=\"U\")),CONCATENATE(B5,B6),B5))","v":0},{"$f":"IF(AF5=0,0,CONCATENATE(C5,AF5))","v":0},{"$f":"IF(AG5=0,0,VLOOKUP(AG5,'List Price'!$B$3:$C$98,2,FALSE))","v":0},2,"White","White","BROWN","BROWN","VIOLET","VIOLET",null,null,"White","White","Brown","Brown","Orange","Orange",null,{"$f":"IF(AG5=0,0,VLOOKUP(AG5,'List Price'!$B$3:$D$98,3,FALSE))","v":0}]
[2,{"$f":"Configurator!K8","v":0},"T",{"$f":"B6","v":0},{"$f":"IF(D6=0,0,CONCATENATE(C6,D6))","v":0},{"$f":"IF(E6=0,0,VLOOKUP($E6,Configurator!$D$12:$L$118,7,FALSE))","v":0},{"$f":"IF(E6=0,0,VLOOKUP($E6,Configurator!$D$12:$L$118,8,FALSE))","v":0},{"$f":"IF(E6=0,0,VLOOKUP($E6,Configurator!$D$12:$L$118,9,FALSE))","v":0},null,{"$f":"F6","v":0},{"$f":"IF(G6=0,0, IF(G6=1,1, IF(G6=2,1)))","v":0},0,{"$f":"H6","v":0},{"$f":"M6-MROUND(M6,1)","v":0},{"$f":"MAX($P7:R$14)","v":0},0,0,0,{"$f":"IF(M6=0,0,MAX(S$5:$S5)+M6)","v":0},{"$f":"S6-MROUND(S6,1)","v":0},0,0,{"$f":"IF(M6=0,0,IF(S6<3,0,IF(N6=0,1,0)))","v":0},{"$f":"IF(M6=0,0,IF(S6<3,0,IF(N6=0,1,0)))","v":0},null,{"$f":"HLOOKUP($Z$4,QD!$B$1:$S$27,AB6+1,FALSE)","v":{"$error":"#N/A"}},{"$f":"IF(Z6=0,\"-\",IF($AA$4=1,(HLOOKUP($AA$3,$AJ$4:$AO$23,$AI6,FALSE)),AB6))","v":{"$error":"#N/A"}},2,null,null,null,0,{"$f":"IF(AF6=0,0,CONCATENATE(C6,AF6))","v":0},{"$f":"IF(AG6=0,0,VLOOKUP(AG6,'List Price'!$B$3:$C$98,2,FALSE))","v":0},3,"Brown","Brown","BN / WT","BN / WT","RED","RED",null,null,"Brown","Brown","White","White","Pink","Pink",null,{"$f":"IF(AG6=0,0,VLOOKUP(AG6,'List Price'!$B$3:$D$98,3,FALSE))","v":0}]
[3,{"$f":"Configurator!L8","v":0},"T",0,0,{"$f":"IF(E7=0,0,VLOOKUP($E7,Configurator!$D$12:$L$118,7,FALSE))","v":0},{"$f":"IF(E7=0,0,VLOOKUP($E7,Configurator!$D$12:$L$118,8,FALSE))","v":0},{"$f":"IF(E7=0,0,VLOOKUP($E7,Configurator!$D$12:$L$118,9,FALSE))","v":0},null,0,0,0,0,0,{"$f":"MAX($P8:R$14)","v":0},0,0,0,{"$f":"IF(M7=0,0,MAX(S$5:$S6)+M7)","v":0},{"$f":"S7-MROUND(S7,1)","v":0},0,{"$f":"IF(M7=0,0,IF(N7=0,IF(S7>3,0,IF(T7=$N$16,1,2)),IF(T7=$N$16,1,2)))","v":0},0,0,null,{"$f":"HLOOKUP($Z$4,QD!$B$1:$S$27,AB7+1,FALSE)","v":{"$error":"#N/A"}},{"$error":"#N/A"},3,null,null,null,0,0,{"$f":"IF(AG7=0,0,VLOOKUP(AG7,'List Price'!$B$3:$C$98,2,FALSE))","v":0},4,"Green","Green","BLUE","BLUE","GREY","GREY",null,null,"Green","Green","Blue","Blue","White","White",null,{"$f":"IF(AG7=0,0,VLOOKUP(AG7,'List Price'!$B$3:$D$98,3,FALSE))","v":0}]
[4,{"$f":"Configurator!M8","v":0},"T",0,0,{"$f":"IF(E8=0,0,VLOOKUP($E8,Configurator!$D$12:$L$118,7,FALSE))","v":0},{"$f":"IF(E8=0,0,VLOOKUP($E8,Configurator!$D$12:$L$118,8,FALSE))","v":0},{"$f":"IF(E8=0,0,VLOOKUP($E8,Configurator!$D$12:$L$118,9,FALSE))","v":0},null,0,0,0,0,0,{"$f":"MAX($P9:R$14)","v":0},0,0,0,{"$f":"IF(M8=0,0,MAX(S$5:$S7)+M8)","v":0},{"$f":"S8-MROUND(S8,1)","v":0},0,{"$f":"IF(M8=0,0,IF(N8=0,IF(S8>3,0,IF(T8=$N$16,1,2)),IF(T8=$N$16,1,2)))","v":0},0,0,null,{"$f":"HLOOKUP($Z$4,QD!$B$1:$S$27,AB8+1,FALSE)","v":{"$error":"#N/A"}},{"$error":"#N/A"},4,null,null,null,0,0,{"$f":"IF(AG8=0,0,VLOOKUP(AG8,'List Price'!$B$3:$C$98,2,FALSE))","v":0},5,"Yellow","Yellow","WHITE","WHITE","RD / BL","RD / BL",null,null,"Yellow","Yellow","Yellow","Violet","Yellow","Yellow",null,{"$f":"IF(AG8=0,0,VLOOKUP(AG8,'List Price'!$B$3:$D$98,3,FALSE))","v":0}]
[5,{"$f":"Configurator!N8","v":0},"T",0,0,{"$f":"IF(E9=0,0,VLOOKUP($E9,Configurator!$D$12:$L$118,7,FALSE))","v":0},{"$f":"IF(E9=0,0,VLOOKUP($E9,Configurator!$D$12:$L$118,8,FALSE))","v":0},{"$f":"IF(E9=0,0,VLOOKUP($E9,Configurator!$D$12:$L$118,9,FALSE))","v":0},null,0,0,0,0,0,{"$f":"MAX($P10:R$14)","v":0},0,0,0,{"$f":"IF(M9=0,0,MAX(S$5:$S8)+M9)","v":0},{"$f":"S9-MROUND(S9,1)","v":0},0,0,0,0,null,{"$f":"HLOOKUP($Z$4,QD!$B$1:$S$27,AB9+1,FALSE)","v":{"$error":"#N/A"}},{"$error":"#N/A"},5,null,null,null,0,0,{"$f":"IF(AG9=0,0,VLOOKUP(AG9,'List Price'!$B$3:$C$98,2,FALSE))","v":0},6,"Grey","Grey","GREEN","GREEN","GREEN","GREEN",null,null,"Grey","Orange","Orange","Orange","Green","Green",null,{"$f":"IF(AG9=0,0,VLOOKUP(AG9,'List Price'!$B$3:$D$98,3,FALSE))","v":0}]
[6,{"$f":"Configurator!O8","v":0},"T",0,0,{"$f":"IF(E10=0,0,VLOOKUP($E10,Configurator!$D$12:$L$118,7,FALSE))","v":0},{"$f":"IF(E10=0,0,VLOOKUP($E10,Configurator!$D$12:$L$118,8,FALSE))","v":0},{"$f":"IF(E10=0,0,VLOOKUP($E10,Configurator!$D$12:$L$118,9,FALSE))","v":0},null,0,0,0,0,0,{"$f":"MAX($P11:R$14)","v":0},0,0,0,{"$f":"IF(M10=0,0,MAX(S$5:$S9)+M10)","v":0},{"$f":"S10-MROUND(S10,1)","v":0},0,0,0,0,null,{"$f":"HLOOKUP($Z$4,QD!$B$1:$S$27,AB10+1,FALSE)","v":{"$error":"#N/A"}},{"$error":"#N/A"},6,null,null,null,0,0,{"$f":"IF(AG10=0,0,VLOOKUP(AG10,'List Price'!$B$3:$C$98,2,FALSE))","v":0},7,"Pink","Pink","YELLOW","YELLOW","BLUE","BLUE",null,null,"Pink","Pink","Pink","Pink","Blue","Blue",null,{"$f":"IF(AG10=0,0,VLOOKUP(AG10,'List Price'!$B$3:$D$98,3,FALSE))","v":0}]
{"$rows_left_out":24}
{"sheet":"QD","index":4,"n_rows":26,"n_cols":19,"rows_kept":26,"cut":false,"hidden":false,"merged":[[15,7,19,7]]}
["Part #","TQ1","TQ2","TQ3","TQ4","TQ5","TQ6","TQ7","TQ8","TQ9","TW1","TW2","TW3","TC2","TC3","TC4","TC5","TC8","TC9"]
[null,"SC1 in",1,"SC1 in","+ 24v","+ 24v",4,4,"SC1 in","SC1 in","+ 24v","+ 24v","+ 24v",1,"SC1 in","+ 24v","+ 24v","SC1 in","SC1 in"]
[null,"SC2 in","+ 24v","+ 24v",1,"SC1 in",3,3,"SC2 in","SC2 in","0 v","0 v","0 v","+ 24v","+ 24v",1,"SC1 in","SC2 in","SC2 in"]
[null,"SC1 out","Earth","Earth","0 v","0 v",2,2,"SC1 out","SC1 out","SC1 in",1,"SC1 in","Earth","Earth","0 v","0 v","SC1 out","SC1 out"]
[null,"SC2 out",2,"SC2 in",2,"SC2 in","+ 24v","+ 24v","SC2 out","SC2 out","SC2 in",2,"SC2 in",2,"SC2 in",2,"SC2 in","SC2 out","SC2 out"]
[null,"Earth",3,"SC1 out",3,"SC1 out","SC2 in","SC2 in",1,1,"SC1 out",3,"SC1 out",3,"SC1 out",3,"SC1 out",1,1]
[null,null,4,"SC2 out",4,"SC2 out","0 v","0 v","0 v","0 v","SC2 out",4,"SC2 out",4,"SC2 out",4,"SC2 out","0 v","0 v"]
[null,null,"0 v","0 v",5,1,7,7,2,2,1,5,1,"0 v","0 v",5,1,2,2]
[null,null,5,1,6,2,6,6,3,3,2,6,2,5,1,6,2,3,3]
[null,null,null,null,7,3,5,5,4,4,3,7,3,null,null,7,3,4,4]
{"$rows_left_out":17}
{"sheet":"List Price","index":5,"n_rows":98,"n_cols":4,"rows_kept":98,"cut":false,"hidden":false,"merged":[]}
[]
[null,null,null,"Weight"]
[null,"TAF",null,0.02]
[null,"TAH",null,0.4]
[null,"TAS",null,0.4]
[null,"TEN",null,0.55000000000000004]
[null,"TEH ",null,0.73]
[null,"THC",null,0.11]
[null,"THM",null,0.25]
[null,"THF",null,{"$f":"D3+$D$9","v":0.27}]
{"$rows_left_out":88}